METHYL FLUORIDE
type: Concept
change note: 2022-03-03 16:32:15.0 [sritz] Insert Concept add broader relation (METHYL FLUORIDE [50753922-d435-4c1a-a4ad-8caa9a67afcb,836054] - HALOCARBONS AND HALOGENS [d46a5046-e1c6-4a09-a2f1-db6a21eda611,832624]);
definition: Methyl fluoride (or fluoromethane) is a colorless flammable gas which is heavier than air. It has an agreeable ether-like odor. It is narcotic in high concentrations. It burns with evolution of hydrogen fluoride. The flame is colorless, similar to alcohol. Under prolonged exposure to fire or intense heat the containers may rupture violently and rocket.
in scheme: sciencekeywords

HALOCARBONS AND HALOGENS
type: Concept