CORNELL/EAS
type: Concept
definition: Earth and Atmospheric Sciences (EAS) is part of a fast moving, interdisciplinary, field of knowledge. Our research responsibility is very broad: to gain a better understanding of how the natural earth systems function, and to work with others to apply this knowledge to develop sustainable relationships. Current challenges call upon us to help society meet its many needs. We are dedicated to training the next generation of specialists who will use earth system sciences in their careers and to providing broad education to the campus community and society beyond Cornell. Join us in learning about geosciences, atmospheric sciences, ocean sciences, and many interdisciplinary variations
in scheme: providers

ACADEMIC
type: Concept