SSTL S1-4
type: Concept
change note: 2022-03-28 13:46:11.0 [mmorahan] insert AltLabel (id: null category: primary text: S1-4 Imager language code: en); insert Definition (id: null text: The S1-4 Imager is a 4-band multispectral (+PAN) VHR optical sensor. language code: en);
change note: 2022-03-28 13:45:06.0 [mmorahan] Insert Concept add broader relation (SSTL S1-4 [5157581a-1d6c-4b5c-9905-b844c4864516,879785] - Imaging Spectrometers/Radiometers [944b7691-af37-4fb4-9393-c114e7997829,871722]);
definition: The S1-4 Imager is a 4-band multispectral (+PAN) VHR optical sensor.
in scheme: instruments

Imaging Spectrometers/Radiometers
type: Concept