COMMERCIAL
type: Concept

GOLDEN SOFTWARE
type: Concept
definition: Golden Software has been located in Golden, Colorado since its founding in March, 1983. It was the brainchild of Dan Smith, who was at that time a graduate student in the Mining Department at the Colorado School of Mines, and of Patrick Madison, a CSM Computer Science Instructor. At that time, personal computers were new and their applications were limited. Mapping applications required mainframe computers and pen plotters.
in scheme: providers