Lidar/Laser Spectrometers
type: Concept

CO2LAS
type: Concept
change note: 2023-01-27 07:35:18.0 [tstevens] insert AltLabel (id: null category: primary text: Carbon Dioxide Laser Absorption Spectrometer language code: en); insert Definition (id: null text: The JPL Carbon Dioxide Laser Absorption Spectrometer is an aircraft instrument for measuring the integrated column content CO2 beneath an aircraft. It does this using a technique called Differential Absorption in which two, invisible, eye-safe lasers are transmitted from the instrument down to the surface where they are reflected back to the instrument and the power of each measured. One of the lasers is absorbed by carbon dioxide while one is not such that the difference in power received can be used to determine the amount of carbon dioxide in the atmospheric column beneath the aircraft. The instrument has been flown on a Twin Otter DHC-6 aircraft and is being prepared for flight on NASA's DC-8 aircraft. language code: en);
change note: 2023-01-27 07:33:56.0 [tstevens] Insert Concept add broader relation (CO2LAS [52a6b69f-7df4-45f4-929f-240183cf2ca0,1202694] - Lidar/Laser Spectrometers [46238695-5577-4fad-91bf-0a2fdf8a9b19,1193961]);
definition: The JPL Carbon Dioxide Laser Absorption Spectrometer is an aircraft instrument for measuring the integrated column content CO2 beneath an aircraft. It does this using a technique called Differential Absorption in which two, invisible, eye-safe lasers are transmitted from the instrument down to the surface where they are reflected back to the instrument and the power of each measured. One of the lasers is absorbed by carbon dioxide while one is not such that the difference in power received can be used to determine the amount of carbon dioxide in the atmospheric column beneath the aircraft. The instrument has been flown on a Twin Otter DHC-6 aircraft and is being prepared for flight on NASA's DC-8 aircraft.
in scheme: instruments