CUMULONIMBUS INCUS
type: Concept
change note: 2017-03-16 10:17:36.0 [sritz] insert Definition (id: null text: The anvil-shaped cloud that comprises the upper portion of mature cumulonimbus clouds; the popular name given to a cumulonimbus capillatus cloud, particularly if it embodies the supplementary feature incus (from the Latin for anvil). language code: en);
change note: 2013-02-14 09:35:09.0 [mpmorahan] Insert Concept add broader relation (CUMULONIMBUS INCUS [52f4dfb0-4583-4d82-8cb7-813ffaadd783,82209] - CUMULONIMBUS CAPILLATUS [eec3cec2-1649-4507-b91d-3a25ab2200ee,82207]);
definition: The anvil-shaped cloud that comprises the upper portion of mature cumulonimbus clouds; the popular name given to a cumulonimbus capillatus cloud, particularly if it embodies the supplementary feature incus (from the Latin for anvil).
in scheme: sciencekeywords

CUMULONIMBUS CAPILLATUS
type: Concept