GOES-14
type: Concept
change note: 2017-09-01 12:58:23.0 [sritz] update Definition (The GOES-O satellite lifted off from Launch Complex 37 at Cape Canaveral Air Force Station in Florida at 6:51 p.m. EDT [2009-06-27] atop a Delta IV rocket. From a position about 22,300 miles above Earth, the advanced weather satellite will keep an unblinking eye on atmospheric conditions in the Eastern United States and Atlantic Ocean. Geostationary Operational Environmental Satellite (GOES)-O represents a continuation of the newest generation of environmental satellites built by Boeing for the National Oceanic and Atmospheric Administration (NOAA) under the technical guidance and project management of NASA's Goddard Space Flight Center, Greenbelt, MD. GOES satellites provide the familiar weather pictures seen on United States television newscasts every day. The GOES imaging and sounding instruments (built by ITT) feature flexible scans for small-scale area viewing in regions of the visible and infrared spectrum allowing meteorologists to improve short-term forecasts. GOES provides nearly continuous imaging and sounding, which allow forecasters to better measure changes in atmospheric temperature and moisture distributions and hence increase the accuracy of their forecasts. GOES environmental information is used for a host of applications, including weather monitoring and prediction models, ocean temperatures and moisture locations, climate studies, cryosphere (ice, snow, glaciers) detection and extent, land temperatures and crop conditions, and hazards detection. The GOES-O&P Imagers have improved resolution in the 13 micrometer channel from 8 km to 4 km. The finer spatial resolution allows an improved cloud-top product, height of atmospheric motion vectors and volcanic ash detection. GOES-O continues the improved image navigation and registration, additional power and fuel lifetime capability, space weather, solar x-ray imaging, search and rescue, and communication services as provided on GOES-13. GOES-P is also in …
change note: 2017-09-01 12:57:27.0 [sritz] insert Definition (id: null text: The GOES-O satellite lifted off from Launch Complex 37 at Cape Canaveral Air Force Station in Florida at 6:51 p.m. EDT [2009-06-27] atop a Delta IV rocket. From a position about 22,300 miles above Earth, the advanced weather satellite will keep an unblinking eye on atmospheric conditions in the Eastern United States and Atlantic Ocean. [Source: GOES project Office NASA Goddard Space Flight Center, http://goespoes.gsfc.nasa.gov/goes/spacecraft/goes_o_spacecraft.html ] Geostationary Operational Environmental Satellite (GOES)-O represents a continuation of the newest generation of environmental satellites built by Boeing for the National Oceanic and Atmospheric Administration (NOAA) under the technical guidance and project management of NASA's Goddard Space Flight Center, Greenbelt, MD. GOES satellites provide the familiar weather pictures seen on United States television newscasts every day. The GOES imaging and sounding instruments (built by ITT) feature flexible scans for small-scale area viewing in regions of the visible and infrared spectrum allowing meteorologists to improve short-term forecasts. GOES provides nearly continuous imaging and sounding, which allow forecasters to better measure changes in atmospheric temperature and moisture distributions and hence increase the accuracy of their forecasts. GOES environmental information is used for a host of applications, including weather monitoring and prediction models, ocean temperatures and moisture locations, climate studies, cryosphere (ice, snow, glaciers) detection and extent, land temperatures and crop conditions, and hazards detection. The GOES-O&P Imagers have improved resolution in the 13 micrometer channel from 8 km to 4 km. The finer spatial resolution allows an improved cloud-top product, height of atmospheric motion vectors and volcanic ash detection. GOES-O continues the improved image navigation and registration, additional power and f…
change note: 2017-09-01 12:47:13.0 [sritz] Insert Concept add broader relation (GOES-14 [530c0bf3-28b9-4cb7-ad4e-979ad7444933,310127] - GOES [6e332c25-caeb-4917-afb6-af757bcecd72,310071]);
definition: The GOES-O satellite lifted off from Launch Complex 37 at Cape Canaveral Air Force Station in Florida at 6:51 p.m. EDT [2009-06-27] atop a Delta IV rocket. From a position about 22,300 miles above Earth, the advanced weather satellite will keep an unblinking eye on atmospheric conditions in the Eastern United States and Atlantic Ocean. Geostationary Operational Environmental Satellite (GOES)-O represents a continuation of the newest generation of environmental satellites built by Boeing for the National Oceanic and Atmospheric Administration (NOAA) under the technical guidance and project management of NASA's Goddard Space Flight Center, Greenbelt, MD. GOES satellites provide the familiar weather pictures seen on United States television newscasts every day. The GOES imaging and sounding instruments (built by ITT) feature flexible scans for small-scale area viewing in regions of the visible and infrared spectrum allowing meteorologists to improve short-term forecasts. GOES provides nearly continuous imaging and sounding, which allow forecasters to better measure changes in atmospheric temperature and moisture distributions and hence increase the accuracy of their forecasts. GOES environmental information is used for a host of applications, including weather monitoring and prediction models, ocean temperatures and moisture locations, climate studies, cryosphere (ice, snow, glaciers) detection and extent, land temperatures and crop conditions, and hazards detection. The GOES-O&P Imagers have improved resolution in the 13 micrometer channel from 8 km to 4 km. The finer spatial resolution allows an improved cloud-top product, height of atmospheric motion vectors and volcanic ash detection. GOES-O continues the improved image navigation and registration, additional power and fuel lifetime capability, space weather, solar x-ray imaging, search and rescue, and communication services as provided on GOES-13. GOES-P is also in ground storage following the completion of enviro…
in scheme: platforms

Geostationary Operational Environmental Satellite (GOES)
type: Concept