SUBSIDENCE RATE
type: Concept
change note: 2016-03-31 10:45:03.0 [gee-cee] insert Definition (id: null text: The rate of groundwater that is withdrawn from certain types of rocks. language code: en);
change note: 2016-03-31 10:44:40.0 [gee-cee] Insert Concept add broader relation (SUBSIDENCE RATE [535b876d-9297-49c2-bdcd-4c33e02a47be,158803] - LAND SUBSIDENCE [a1bf1e84-c4e7-4154-ad0a-4b9eedf45066,85537]);
definition: The rate of groundwater that is withdrawn from certain types of rocks.
in scheme: sciencekeywords

LAND SUBSIDENCE
type: Concept