VA/VDGIF/FWIS
type: Concept
definition: The Virginia Fish and Wildlife Information Service is a database of the most current and comprehensive information about all of Virginia's wildlife resources. Website: http://vafwis.org/fwis/
in scheme: providers

VIRGINIA
type: Concept