CA/NFLD/DME/PRDD
type: Concept
definition: Our long term goals guide all branch level activities and progress against each is measured through outcome achievements. These goals are: To advance responsible mineral and energy exploration activities. To maintain and/or enhance responsible mineral and energy resource development. To ensure that mineral and energy resource activities are managed in the best interests of the province. To be recognized as a leader in creating and following best practices in resource assessment, development and management. Summary provided By: http://www.nr.gov.nl.ca/mines&en/aboutus/
in scheme: providers

CANADA
type: Concept