MARINE MAMMALS
type: Concept

DOLPHINS
type: Concept
change note: 2021-10-12 12:59:29.0 [tstevens] insert Definition (id: null text: Small to medium-sized odontocetes that live in marine habitats, have conical teeth and a falcate dorsal fin set near the middle to the back. language code: en);
change note: 2021-10-12 12:59:00.0 [tstevens] Insert Concept add broader relation (DOLPHINS [557e8ffd-807d-41b7-9cd3-ccc3f2690cf5,763849] - MARINE MAMMALS [4cf1a3bd-20ce-42d7-95ac-9a4ece7be12c,763836]);
definition: Small to medium-sized odontocetes that live in marine habitats, have conical teeth and a falcate dorsal fin set near the middle to the back.
in scheme: sciencekeywords