USDA/ARS/CSRL
type: Concept
definition: Greetings from the Crop Science Research Laboratory where we conduct research in three different management units, the Cotton Genetics and Precisions Agriculture Research Unit, the Waste Management and Forage Research Unit, and the Corn Host Plant Resistance Research Unit. Please visit each of these management unit web sites for details about their current research projects and the personnel that are activately pursuing the different and diverse research of their Unit. Summary provided by: http://www.ars.usda.gov/main/site_main.htm?modecode=64-06-15-00
in scheme: providers

USDA
type: Concept