GRAVITY/GRAVITATIONAL FIELD
type: Concept

GRAVITATIONAL FIELD
type: Concept
change note: 2017-03-10 10:50:41.0 [tstevens] update Definition (Pertaining to the measurement, strength, size, etc. of the Earth's gravitational field.); update Definition (Boston University Department of Physics);
definition: Pertaining to the measurement, strength, size, etc. of the Earth's gravitational field.
in scheme: sciencekeywords