GIS
type: Concept
definition: [From the Global Impact Studies Project mission statement, "http://gisp.gi.alaska.edu/mission.htm"] The mission of GLOBAL IMPACT STUDIES PROJECT (GISP) is to promote, encourage, and guide international studies of terrestrial impact structures, particularly those directed toward gaining a better understanding of the cratering process and its effects on the geological and biological evolution of planet Earth.
in scheme: projects

G - I
type: Concept