PANMUX
type: Concept
definition: [Summary provided by the Brazil National Institute for Space Research (INPE), http://www.cbers.inpe.br/en/programas/cbers3-4.htm ] The PanMux Camera (PANMUX) is a high resolution camera that will be found on the CBERS-3 and 4 satellite. Brazilian participation in this program will be enlarged up to 50%, thus taking Brazil to a condition of equality with its partner. CBERS-3 is expected to be launched in 2009, CBERS-4 in 2011. CBERS-3 and 4 satellites represent an evolution of CBERS-1 and 2. Group: Instrument_Details Entry_ID: PANMUX Group: Instrument_Identification Instrument_Category: Earth Remote Sensing Instruments Instrument_Class: Passive Remote Sensing Instrument_Type: Photon/Optical Detectors Instrument_Subtype: Cameras Short_Name: PANMUX Long_Name: PanMux Camera End_Group Group: Instrument_Associated_Sensors Short_Name: CAMERAS End_Group Group: Associated_Platforms Short_Name: CBERS-4 Short_Name: CBERS-3 End_Group Group: Spectral_Frequency_Information Wavelength_Keyword: Visible Spectral_Frequency_Coverage_Range: 0.51µm -0.75 µm End_Group Group: Spectral_Frequency_Information Wavelength_Keyword: Visible Spectral_Frequency_Coverage_Range: 0.51 µm - 0.85 µm End_Group Group: Spectral_Frequency_Information Wavelength_Keyword: Visible Spectral_Frequency_Coverage_Range: 0.52 µm -0.59 µm End_Group Group: Spectral_Frequency_Information Wavelength_Keyword: Visible Spectral_Frequency_Coverage_Range: 0.63 µm - 0.69 µm End_Group Group: Spectral_Frequency_Information Wavelength_Keyword: Near Infrared Spectral_Frequency_Coverage_Range: 0.77 µm -0.89 µm End_Group Online_Resource: http://www.cbers.inpe.br/en/programas/cbers3-4_cameras.htm Creation_Date: 2008-08-19 Group: Instrument_Logistics Data_Rate: 140 Mbit/s (B01), 100 Mbit/s (B02.B03.B04) Instrument_Owner: Brazil National Institute for Space Research (INPE) Instrument_Owner: China National Space Administration End_Group End_Group
in scheme: instruments

Cameras
type: Concept