IFIS-P/FSC
type: Concept
definition: FSTA Direct™ provides flexible access to the full FSTA - Food Science and Technology Abstracts® database to suit your budget. Summary Provided By: http://www.foodsciencecentral.com/fsc/FSTADirect
in scheme: providers

NON-GOVERNMENT/NON-PROFIT ORGANIZATIONS
type: Concept