TIRS
type: Concept
change note: 2013-02-07 11:01:45.0 [saritz] Insert Concept add broader relation (TIRS [58207caf-121d-4f88-bd79-11cafefa3f5b,82113] - Imaging Spectrometers/Radiometers [944b7691-af37-4fb4-9393-c114e7997829,74845]);
change note: 2023-06-06 12:17:07.0 [sritz] update Definition ([The Thermal Infrared Sensor (TIRS) measures land surface temperature in two thermal bands with a new technology that applies quantum physics to detect heat. TIRS was added to the satellite mission when it became clear that state water resource managers rely on the highly accurate measurements of Earth’s thermal energy obtained by Landsat 8’s predecessors, Landsat 5 and Landsat 7, to track how land and water are being used. With nearly 80 percent of the fresh water in the Western U.S. being used to irrigate crops, TIRS is an invaluable tool for managing water consumption. TIRS uses Quantum Well Infrared Photodetectors (QWIPs) to detect long wavelengths of light emitted by the Earth whose intensity depends on surface temperature. These wavelengths, called thermal infrared, are well beyond the range of human vision. QWIPs are a new, lower-cost alternative to conventional infrared technology and were developed at NASA’s Goddard Space Flight Center in Greenbelt, Md. More Information: https://landsat.gsfc.nasa.gov/article/thermal-infrared-sensor-tirs/ Group: Instrument_Details Entry_ID: TIRS Group: Instrument_Identification Instrument_Category: Earth Remote Sensing Instruments Instrument_Class: Passive Remote Sensing Instrument_Type: Spectrometers/Radiometers Instrument_Subtype: Imaging Spectrometers/Radiometers Short_Name: TIRS Long_Name: Thermal Infrared Sensor End_Group Group: Associated_Platforms Short_Name: LANDSAT-8 End_Group Group: Spectral_Frequency_Information Wavelength_Keyword: Infrared > Thermal Number_Channels: 1 Spectral_Frequency_Coverage_Range: 10.6-11.2 μm End_Group Group: Spectral_Frequency_Information Wavelength_Keyword: Infrared > Thermal Number_Channels: 1 Spectral_Frequency_Coverage_Range: 11.5-12.5 μm End_Group Online_Resource: https://landsat.gsfc.nasa.gov/article/thermal-infrared-sensor-tirs/ Creation_Date: 2013-02-07 Group: Instrument_Logistics Instrument_Owner: USA/NASA Instrument_Owner: USA/NOAA…
change note: 2023-06-06 12:17:40.0 [sritz] update Definition (The Thermal Infrared Sensor (TIRS) measures land surface temperature in two thermal bands with a new technology that applies quantum physics to detect heat. TIRS was added to the satellite mission when it became clear that state water resource managers rely on the highly accurate measurements of Earth’s thermal energy obtained by Landsat 8’s predecessors, Landsat 5 and Landsat 7, to track how land and water are being used. With nearly 80 percent of the fresh water in the Western U.S. being used to irrigate crops, TIRS is an invaluable tool for managing water consumption. TIRS uses Quantum Well Infrared Photodetectors (QWIPs) to detect long wavelengths of light emitted by the Earth whose intensity depends on surface temperature. These wavelengths, called thermal infrared, are well beyond the range of human vision. QWIPs are a new, lower-cost alternative to conventional infrared technology and were developed at NASA’s Goddard Space Flight Center in Greenbelt, Md. More Information: https://landsat.gsfc.nasa.gov/article/thermal-infrared-sensor-tirs/ Group: Instrument_Details Entry_ID: TIRS Group: Instrument_Identification Instrument_Category: Earth Remote Sensing Instruments Instrument_Class: Passive Remote Sensing Instrument_Type: Spectrometers/Radiometers Instrument_Subtype: Imaging Spectrometers/Radiometers Short_Name: TIRS Long_Name: Thermal Infrared Sensor End_Group Group: Associated_Platforms Short_Name: LANDSAT-8 End_Group Group: Spectral_Frequency_Information Wavelength_Keyword: Infrared > Thermal Number_Channels: 1 Spectral_Frequency_Coverage_Range: 10.6-11.2 μm End_Group Group: Spectral_Frequency_Information Wavelength_Keyword: Infrared > Thermal Number_Channels: 1 Spectral_Frequency_Coverage_Range: 11.5-12.5 μm End_Group Online_Resource: https://landsat.gsfc.nasa.gov/article/thermal-infrared-sensor-tirs/ Creation_Date: 2013-02-07 Group: Instrument_Logistics Instrument_Owner: USA/NASA Instrument_Owner: USA/NOAA …
definition: The Thermal Infrared Sensor (TIRS) measures land surface temperature in two thermal bands with a new technology that applies quantum physics to detect heat. TIRS was added to the satellite mission when it became clear that state water resource managers rely on the highly accurate measurements of Earth’s thermal energy obtained by Landsat 8’s predecessors, Landsat 5 and Landsat 7, to track how land and water are being used. With nearly 80 percent of the fresh water in the Western U.S. being used to irrigate crops, TIRS is an invaluable tool for managing water consumption. TIRS uses Quantum Well Infrared Photodetectors (QWIPs) to detect long wavelengths of light emitted by the Earth whose intensity depends on surface temperature. These wavelengths, called thermal infrared, are well beyond the range of human vision. QWIPs are a new, lower-cost alternative to conventional infrared technology and were developed at NASA’s Goddard Space Flight Center in Greenbelt, Md. More Information: https://landsat.gsfc.nasa.gov/article/thermal-infrared-sensor-tirs/ Group: Instrument_Details Entry_ID: TIRS Group: Instrument_Identification Instrument_Category: Earth Remote Sensing Instruments Instrument_Class: Passive Remote Sensing Instrument_Type: Spectrometers/Radiometers Instrument_Subtype: Imaging Spectrometers/Radiometers Short_Name: TIRS Long_Name: Thermal Infrared Sensor End_Group Group: Associated_Platforms Short_Name: LANDSAT-8 End_Group Group: Spectral_Frequency_Information Wavelength_Keyword: Infrared > Thermal Number_Channels: 1 Spectral_Frequency_Coverage_Range: 10.6-11.2 μm End_Group Group: Spectral_Frequency_Information Wavelength_Keyword: Infrared > Thermal Number_Channels: 1 Spectral_Frequency_Coverage_Range: 11.5-12.5 μm End_Group Online_Resource: https://landsat.gsfc.nasa.gov/article/thermal-infrared-sensor-tirs/ Creation_Date: 2013-02-07 Group: Instrument_Logistics Instrument_Owner: USA/NASA Instrument_Owner: USA/NOAA End_Group End_Group
in scheme: instruments

Imaging Spectrometers/Radiometers
type: Concept