NATURAL GAS VERTICAL/GEOGRAPHIC DISTRIBUTION
type: Concept
change note: 2013-03-11 12:39:04.0 [tbs1979] insert Definition (id: null text: The vertical and geographic distribution of natural gas within the solid Earth. language code: en);
change note: 2013-03-05 10:16:17.0 [tbs1979] update PrefLabel (NATURAL GAS VERTICAL/GEOGRAPHIC DISTRIBUTION);
change note: 2013-03-05 10:13:51.0 [tbs1979] Insert Concept add broader relation (NATURAL GAS VERTICAL/GEOGRAPHICAL DISTRIBUTION [58769369-608c-4482-924b-207454a5fb1c,82909] - NATURAL GAS [72eb280a-d5d0-4c5e-b789-8f1a8cf8bdac,63023]);
definition: The vertical and geographic distribution of natural gas within the solid Earth.
in scheme: sciencekeywords

NATURAL GAS
type: Concept