Meteor-3M
type: Concept
change note: 2019-05-31 13:11:26.0 [sritz] update Definition (METEOR-3M Mission: The Meteor-3M satellite mission is a joint partnership between NASA and the Russian Aviation and Space Agency (RASA). It was initiated by the Gore-Chernomyrdin Commission in 1994 and extends a long-term working relationship between the United States and Russia to understand Earth's environment. Spacecraft Information: The Meteor-3M spacecraft is an advanced model of the Meteor spacecraft that was developed over 30 years ago. The payload includes SAGE III and other instruments. Measurements Taken: 1. temperature and humidity profiles 2. clouds, 3. surface properties 4. high energy particles in the upper atmosphere. Solar measurements are collected twice each orbit when the satellite ascends or descends from behind the Earth. Lunar measurements are collected when at least 50% of the moon is visible and the sun is not. Additional information available at: https://nssdc.gsfc.nasa.gov/nmc/spacecraft/display.action?id=2001-056A [Summary provided by NASA] Group: Platform_Details Entry_ID: METEOR-3M Group: Platform_Identification Platform_Category: Earth Observation Satellites Platform_Series_or_Entity: METEOR Short_Name: METEOR-3M End_Group Group: Synonymous_Platform_Names Short_Name: SAGE III/Meteor 3M Short_Name: 26701 End_Group Group: Platform_Associated_Instruments Short_Name: SAGE III End_Group Group: Orbit Orbit_Inclination: 99.7° Period: 105.0 minutes Perigee: 996.0 km Apogee: 1016.0 km End_Group Creation_Date: 2009-02-27 Online_Resource: http://nssdc.gsfc.nasa.gov/nmc/spacecraftDisplay.do?id=2001-056A Group: Platform_Logistics Launch_Date: 2001-12-10 Launch_Site: Baikonur Cosmodrome, Tyuratam, Russia Primary_Sponsor: Russia Primary_Sponsor: USA/NASA End_Group End_Group);
change note: 2019-05-31 13:08:33.0 [sritz] insert WeightedRelation (id: null related concept uuid: b9f2cf4a-c2f0-4e78-847f-71fbbbce2f24 relationship type: null relationship value: null generated by: null);
change note: 2015-05-08 14:51:16.0 [saritz] update PrefLabel (Meteor-3M);
change note: 2019-05-31 13:09:31.0 [sritz] update WeightedRelation (Similar); update WeightedRelation (1); update WeightedRelation (Instrument-Sensor); update WeightedRelation (1);
change note: 2019-05-31 13:02:34.0 [sritz] insert WeightedRelation (id: null related concept uuid: 1c0794e7-622d-47bf-9ca1-1da7232193df relationship type: null relationship value: null generated by: null);
definition: METEOR-3M Mission: The Meteor-3M satellite mission is a joint partnership between NASA and the Russian Aviation and Space Agency (RASA). It was initiated by the Gore-Chernomyrdin Commission in 1994 and extends a long-term working relationship between the United States and Russia to understand Earth's environment. Spacecraft Information: The Meteor-3M spacecraft is an advanced model of the Meteor spacecraft that was developed over 30 years ago. The payload includes SAGE III and other instruments. Measurements Taken: 1. temperature and humidity profiles 2. clouds, 3. surface properties 4. high energy particles in the upper atmosphere. Solar measurements are collected twice each orbit when the satellite ascends or descends from behind the Earth. Lunar measurements are collected when at least 50% of the moon is visible and the sun is not. Additional information available at: https://nssdc.gsfc.nasa.gov/nmc/spacecraft/display.action?id=2001-056A [Summary provided by NASA] Group: Platform_Details Entry_ID: METEOR-3M Group: Platform_Identification Platform_Category: Earth Observation Satellites Platform_Series_or_Entity: METEOR Short_Name: METEOR-3M End_Group Group: Synonymous_Platform_Names Short_Name: SAGE III/Meteor 3M Short_Name: 26701 End_Group Group: Platform_Associated_Instruments Short_Name: SAGE III End_Group Group: Orbit Orbit_Inclination: 99.7° Period: 105.0 minutes Perigee: 996.0 km Apogee: 1016.0 km End_Group Creation_Date: 2009-02-27 Online_Resource: http://nssdc.gsfc.nasa.gov/nmc/spacecraftDisplay.do?id=2001-056A Group: Platform_Logistics Launch_Date: 2001-12-10 Launch_Site: Baikonur Cosmodrome, Tyuratam, Russia Primary_Sponsor: Russia Primary_Sponsor: USA/NASA End_Group End_Group
in scheme: platforms

Meteor
type: Concept