UMAINE/DG/BPP
type: Concept
definition: Earth Sciences is the most multidisciplinary of the natural sciences. Our understanding of the Earth and other planets is based on research across the broad spectrum of Earth Sciences including Geodynamics and Crustal studies, Glacial and Climate studies, Anthropology, Paleoecology, Earth Systems, Marine Geology and Environmental Geology. Summary Provided by: http://www.geology.um.maine.edu/HTML-ERS/Welcome/Welcome.htm
in scheme: providers

ACADEMIC
type: Concept