Chemical Meters/Analyzers
type: Concept

Thermo Scientific Ozone Analyzer
type: Concept
change note: 2021-05-10 14:20:40.0 [tstevens] insert AltLabel (id: null category: primary text: Thermo Scientific Model 49i Ozone Analyzer language code: en); insert Definition (id: null text: Measure the amount of ozone in ambient air with the dual-cell, UV photometric Thermo Scientific™ Model 49i Ozone Analyzer. language code: en);
change note: 2021-05-10 14:19:31.0 [tstevens] Insert Concept add broader relation (Thermo Scientific Ozone Analyzer [5a9aea9c-9193-4074-a444-9073e348d5ad,606916] - Chemical Meters/Analyzers [3d25724b-832f-4a61-b0b2-4f2ccecdba94,598603]);
definition: Measure the amount of ozone in ambient air with the dual-cell, UV photometric Thermo Scientific™ Model 49i Ozone Analyzer.
in scheme: instruments