PHILIPPINES
type: Concept

PH/DOST/PCARRD
type: Concept
definition: The Philippine Council for Agriculture, Forestry and Natural Resources Research and Development (PCARRD) is one of the five sectoral councils of the Department of Science and Technology (DOST). It serves as the main arm of DOST in planning, evaluating, monitoring, and coordinating the national research and development (R&D) programs in agriculture, forestry, environment, and natural resources sectors. Its technical research divisions include crops, livestock, forestry and environment, agricultural resources management, and socioeconomics. Website: "http://www.pcarrd.dost.gov.ph/" [Summary provided by PCARRD.]
in scheme: providers