COD/NGWL
type: Concept
definition: The Next Generation Weather Lab at the College of DuPage is an extensive source for National Weather Service text products covering all 50 states in the United States. Included are text products issued from from the NOAA Storm Prediction Center, National Centers for Environmental Prediction (NCEP), and the NOAA Tropical Prediction Center (TPC). Analysis, satellite, radar, and forecast model data may also be downloaded from this site. Website: "http://weather.cod.edu/"
in scheme: providers

ACADEMIC
type: Concept