GEOFON
type: Concept
definition: GEOFON is a program which consists of three components, the permanent broadband seismological network, a varying number of mobile network deployments and the GEOFON Data Center. For more information, please see: http://www.gfz-potsdam.de/geofon/
in scheme: projects

G - I
type: Concept