SEA SURFACE HEIGHT ANOMALY (SSHA)
type: Concept

SEA SURFACE HEIGHT
type: Concept
change note: 2021-01-11 12:14:19.0 [tstevens] Insert Concept add narrower relation (SEA SURFACE HEIGHT [5c0b448c-7eb4-4e8c-8403-260cbb6114bb,85103] - SEA SURFACE HEIGHT ANOMALY _SSHA_ [3798a6c9-9b39-4e22-bee4-be80d39049fe,560812]);
definition: The height of the ocean surface above a datum, such as a vertical datum for sea level measurements, or a reference ellipsoid for satellite altimetric measurements.
in scheme: sciencekeywords

SEA SURFACE TOPOGRAPHY
type: Concept