Radiometers
type: Concept

NMLR
type: Concept
definition: The Nebraska Multiband Leaf Radiometer (NMLR) is an instrument used during leaf optical measurements) wavebands. [Summary provided by ORNL]
in scheme: instruments