USDA/FS/NERS/FSL
type: Concept
definition: The Northeastern Research Station is one of six regional field units that make up the Research and Development Division of the USDA Forest Service. Information provided by: http://www.fs.fed.us/ne/newtown_square/aboutus/
in scheme: providers

USDA
type: Concept