Jet
type: Concept

LEARJET
type: Concept
change note: 2020-03-26 17:49:26.0 [sritz] update Resource (image); insert WeightedRelation (id: null related concept uuid: 5e573a56-b485-4a7f-a652-6d941e7d0ce0 relationship type: null relationship value: null generated by: null);
change note: 2021-11-17 11:55:41.0 [tstevens] Move Concepts delete broader relation (null); add broader relation (LEARJET [5c7ba790-030e-4cd6-99e8-9fe9809c5052,826287] - Propeller [6175c78e-432c-4254-b442-40d3cf0f6b34,835882]);
change note: 2020-03-26 17:50:08.0 [sritz] update WeightedRelation (Platform-Instrument); update WeightedRelation (1.0);
change note: 2020-03-26 18:06:06.0 [sritz] update WeightedRelation (Undefined);
change note: 2022-04-15 12:11:48.0 [sritz] Move Concepts delete broader relation (null); add broader relation (LEARJET [5c7ba790-030e-4cd6-99e8-9fe9809c5052,884639] - Jet [5b8e4067-db4e-42d4-b4a5-7de5e683125d,884636]);
definition: The Learjet started life as an abortive Swiss ground-attack fighter aircraft, the FFA P-16. Development started in 1952 and prototypes were ordered the next year. The first prototypes flew in 1955 and construction and testing continued until 1958 when an order for 100 was placed. This was reversed soon after due to a crash of the third prototype. Two additional prototypes were finished, the last in 1960, but the project was ended at this point. The basic structure of this aircraft was seen by Bill Lear and his team as a good starting point to the development of a business jet, which was originally intended to be called the SAAC-23. The wing with its distinctive tip fuel tanks and landing gear of the first Learjets were little changed from those used by the fighter prototypes. The tooling for building the aircraft was purchased and moved to Wichita, Kansas in 1962. On February 7, assembly of the first Learjet began. The next year, the company was renamed the Lear Jet Corporation. [Text provided by: http://en.wikipedia.org/wiki/Learjet ] [Photo provided by: http://www.aerospace-technology.com ] Group: Platform_Details Entry_ID: LEARJET Group: Platform_Identification Platform_Category: Aircraft Short_Name: LEARJET End_Group Creation_Date: 2008-07-14 Online_Resource: http://www.learjet.com/ Online_Resource: http://en.wikipedia.org/wiki/Learjet Sample_Image: http://www.aerospace-technology.com/projects/learjet/images/Learjet45_2.jpg End_Group
in scheme: platforms