MAXIMUM/MINIMUM TEMPERATURE
type: Concept

24 HOUR MINIMUM TEMPERATURE
type: Concept
change note: 2013-10-16 18:36:30.0 [saritz] added new definition insert Definition (id: null text: The lowest temperature attained at a specific location during a (24 hour) period. language code: en);
change note: 2013-09-04 14:09:36.0 [epneff] Insert Concept add broader relation (24 HOUR MINIMUM TEMPERATURE [5c7f35d5-a3ec-4010-b1c3-6e98ac29dc3f,105793] - MAXIMUM/MINIMUM TEMPERATURE [5164162a-60eb-4c94-a0f0-2caaa3bb1754,86703]);
definition: The lowest temperature attained at a specific location during a (24 hour) period.
in scheme: sciencekeywords