Permanent Land Sites
type: Concept

SOLAR OBSERVATORY STATIONS
type: Concept
change note: 2022-02-08 13:12:09.0 [tstevens] insert Definition (id: null text: A solar observatory is an observatory that specializes in monitoring the Sun. These observatories usually have one or more solar telescopes. language code: en);
change note: 2021-11-17 14:14:55.0 [tstevens] Move Concepts delete broader relation (null); add broader relation (SOLAR OBSERVATORY STATIONS [5d5dddb9-ba89-49c4-bf06-d9abbe56b329,826292] - Permanent Land Sites [0ec10fd9-492c-498a-b6d8-e2840cc3643b,835887]);
definition: A solar observatory is an observatory that specializes in monitoring the Sun. These observatories usually have one or more solar telescopes.
in scheme: platforms