STRAIN
type: Concept
change note: 2013-03-08 13:23:13.0 [tbs1979] Move Concepts add broader relation (STRAIN [5d7f7568-bfc3-4c11-b446-c4f6488c8ae9,64255] - PLATE TECTONICS [71e9bc66-6f8c-41ec-8b22-2fe390223639,64395]); delete broader relation (null);
definition: Pertaining to the measurement, analysis, or modeling of strain that has occurred in the Earth's crust, either through in-situ measurements, or through laboratory experiments.
in scheme: sciencekeywords

PLATE TECTONICS
type: Concept