NGRIP
type: Concept
definition: NGRIP is a multinational research program, funded by participating institutions in Germany, Japan, Sweden, Switzerland, France, Belgium, Iceland and the US. Primary sponsor is the Danish Research Council. Information provided by http://www.gfy.ku.dk/~www-glac/ngrip/index_eng.htm
in scheme: projects

M - O
type: Concept