NSRN
type: Concept
change note: 2022-02-08 13:54:03.0 [tstevens] update Definition (The NOAA Solar Radiation Network is a collection of stations that provides solar radiations information, specifically, the amount of energy a user can expect from the Sun.); update Definition (Renewable Resource Data Center);
change note: 2021-11-18 08:33:18.0 [tstevens] Move Concepts delete broader relation (null); add broader relation (NSRN [5f65fc52-a4f7-4ae0-a352-74fae989f9aa,826296] - Vehicles [8dc44d7b-e349-42ab-860e-18f5acfc1b28,835888]);
definition: The NOAA Solar Radiation Network is a collection of stations that provides solar radiations information, specifically, the amount of energy a user can expect from the Sun.
in scheme: platforms

Vehicles
type: Concept