GLACIAL MEASUREMENTS
type: Concept

GLACIER MASS BALANCE/ICE SHEET MASS BALANCE
type: Concept
change note: 2012-07-10 10:58:51.0 [mpmorahan] insert Definition (id: null text: Mass balance describes the net gain or loss of snow and ice through a given year. It is usually expressed in terms of water gain or loss. language code: en);
change note: 2012-06-26 13:25:56.0 [gee-cee] Insert Concept add broader relation (GLACIER MASS BALANCE/ICE SHEET MASS BALANCE [6095d796-68e0-4c7d-aa4f-f2e5bd8c4916,39913] - GLACIAL MEASUREMENTS [2d79af4f-d15f-40cc-b0bf-8f5c8eb1fce5,39907]);
definition: Mass balance describes the net gain or loss of snow and ice through a given year. It is usually expressed in terms of water gain or loss.
in scheme: sciencekeywords