DISCHARGE/FLOW
type: Concept

BASE FLOW
type: Concept
change note: 2016-03-31 08:59:29.0 [gee-cee] insert Definition (id: null text: The portion of stream flow that is not runoff and results from seepage of water from the ground into a channel slowly over time. The primary source of running water in a stream during dry weather. language code: en);
change note: 2016-03-31 08:58:41.0 [gee-cee] Insert Concept add broader relation (BASE FLOW [609f7831-5145-4a5c-bd58-d0b426058740,158735] - DISCHARGE/FLOW [36a2999b-2255-4d4e-a249-40df3b7b3aaf,158733]);
definition: The portion of stream flow that is not runoff and results from seepage of water from the ground into a channel slowly over time. The primary source of running water in a stream during dry weather.
in scheme: sciencekeywords