CLOUD MICROPHYSICS
type: Concept

ICE NUCLEI
type: Concept
change note: 2022-08-02 16:45:28.0 [sritz] insert Definition (id: null text: Any particle that serves as a nucleus leading to the formation of ice crystals without regard to the particular physical processes involved in the nucleation. language code: en);
change note: 2022-08-02 16:43:16.0 [sritz] Insert Concept add broader relation (ICE NUCLEI [60bb6ddf-29b1-4dad-9c9f-27f040a43bba,1011359] - CLOUD MICROPHYSICS [0cfcbaa7-727b-4199-8cca-93824b427e9b,1009858]);
definition: Any particle that serves as a nucleus leading to the formation of ice crystals without regard to the particular physical processes involved in the nucleation.
in scheme: sciencekeywords