CA/NRCAN/ESS/GC/CCMEO
type: Concept
change note: 2013-10-10 09:54:48.0 [mpmorahan] update PrefLabel (CA/NRCAN/ESS/GC/CCMEO); update AltLabel (Canada Centre For Mapping And Earth Observation, Earth Sciences Sector, Natural Resources Canada);
definition: "http://www.ccrs.nrcan.gc.ca/" Description: The Canada Centre For Mapping And Earth Observation(CCMEO) is internationally recognized as a leading centre of excellence in the use of earth-observation data, and supports an expanding industry sector includingthe world leaders in global ground station, image analysis and radar mapping markets. CCMEO is responsible for the reception, processing, archiving and dissemination of remotely sensed data for Canada. In conjunction with the private sector, it develops remote sensing technology and applications. CCMEO, through its National Atlas of Canada team, also works with indust ry to develop geospatia information applications. CCMEO is developing the Canadian Earth Observation Network component of the Canadian Geospatial Data Infrastructure to provide users with real-time access to remote sensing satellite and other spatial databases, both land and ocean, through the Internet. Search the CCMEO Data Catalogue: "http://ceonet.cgdi.gc.ca/"
in scheme: providers

CANADA
type: Concept