USDA/NRCS/NEBRASKA
type: Concept
definition: The Nebraska Division of the Natural Resources Conservation Service provides support to help people conserve, maintain, and improve our natural resources and environment within Nebraska. Website: "http://www.ne.nrcs.usda.gov/" [Summary provided by the USDA.]
in scheme: providers

USDA
type: Concept