FIELD CROP PRODUCTS
type: Concept
definition: Measurements related to any field crop (plants grown primarily for their seed, e.g. corn, wheat, oats, soybeans) products which are articles of commerce.
in scheme: sciencekeywords

PLANT COMMODITIES
type: Concept