Living Organism-based Platforms
type: Concept

Living Organism
type: Concept
change note: 2022-02-18 12:33:00.0 [tstevens] insert Definition (id: null text: A 'living platform" such as a bird, whale, turtle, fish, caribou, wolf, or other animal where they are used to hold GPS units to track movement or migration. Cameras can also be attached to the animals for scientists to observe their habitat, eating, and behavioral habits. language code: en);
change note: 2021-11-18 08:45:42.0 [tstevens] Insert Concept add broader relation (Living Organism [6438d343-2e1f-4a89-97a9-b032e651163f,835889] - Living Organism-based Platforms [2385b75c-6ff2-41f8-9cd8-9b5225e4a862,835873]);
change note: 2021-11-18 08:46:08.0 [tstevens] Insert Concept add narrower relation (Living Organism [6438d343-2e1f-4a89-97a9-b032e651163f,835889] - Living Organism [ecc4a2bb-f195-4296-b300-c1227221b688,835890]);
definition: A 'living platform" such as a bird, whale, turtle, fish, caribou, wolf, or other animal where they are used to hold GPS units to track movement or migration. Cameras can also be attached to the animals for scientists to observe their habitat, eating, and behavioral habits.
in scheme: platforms

Living Organism
type: Concept