U-CADIZ/FA
type: Concept
definition: Summary Provided By: http://translate.google.com/translate?hl=en&sl=es&u=http://www2.uca.es/dept/fisica_aplicada/&sa=X&oi=translate&resnum=1&ct=result&prev=/search%3Fq%3D%2BDepartamento%2BFisica%2BAplicada,%2BUniversidad%2Bde%2BCadiz%26hl%3Den%26sa%3DG
in scheme: providers

ACADEMIC
type: Concept