UNEP/GRID-ARENDAL
type: Concept
definition: GRID-Arendal provides environmental information, communications, and capacity building services for information management and assessment. Established to strengthen the United Nations through its Environment Programme (UNEP), our focus is to make credible, science-based knowledge understandable to the public and to decision-making for sustainable development. Website: "http://www.grida.no/" [Summary provided by the United Nations Environmental Programme.]
in scheme: providers

MULTINATIONAL ORGANIZATIONS
type: Concept