AMMONIA
type: Concept
definition: A gaseous compound of one nitrogen atom and three hydrogen atoms, NH3, that is highly water-soluble. A dissolved form, ammonium, NH4+, is a nutrient and is listed as a detailed variable under ammonia.
in scheme: sciencekeywords

OCEAN CHEMISTRY
type: Concept