UPPER LEVEL WINDS
type: Concept

WIND SPEED
type: Concept
change note: 2017-04-20 14:50:29.0 [sritz] Rename Concept update PrefLabel (WIND SPEED);
change note: 2013-10-28 17:26:54.0 [saritz] Insert Concept add broader relation (WIND SPEED/WIND DIRECTION [661591b3-6685-4de7-a2a4-9ce8ae505044,105901] - UPPER LEVEL WINDS [592d49c4-e8ae-4ab4-bf24-ae4a896d0637,83357]);
change note: 2017-04-21 12:52:54.0 [tstevens] update Definition (Ratio of the distance covered by the air to the time taken to cover it. The instantaneous speed corresponds to the case of an infinitely small time interval. The mean speed corresponds to the case of a finite time interval. It is one component of wind velocity, the other being wind direction.);
change note: 2017-04-21 14:03:32.0 [sritz] update Definition (Glossary of Meteorology, American Meteorological Society);
definition: Ratio of the distance covered by the air to the time taken to cover it. The instantaneous speed corresponds to the case of an infinitely small time interval. The mean speed corresponds to the case of a finite time interval. It is one component of wind velocity, the other being wind direction.
in scheme: sciencekeywords