RADIOCARBON
type: Concept
definition: A radioactive isotope of carbon (carbon-14) with a half-life of about 5730 years, widely used in the dating of organic materials.
in scheme: sciencekeywords

OCEAN CHEMISTRY
type: Concept