ICE SHELVES
type: Concept
change note: 2020-01-14 08:13:52.0 [tstevens] Insert Concept add broader relation (ICE SHELVES [681e59ee-2006-454d-82d3-c9be49cc67a5,559631] - GLACIERS/ICE SHEETS [8603db51-3484-4439-8b3b-a06f48e8c686,83513]);
definition: Portions of glaciers/ice sheets that are floating over the ocean.
in scheme: sciencekeywords

GLACIERS/ICE SHEETS
type: Concept