SEA SURFACE SUBSKIN TEMPERATURE
type: Concept
change note: 2023-03-02 17:12:18.0 [sritz] update PrefLabel (SEA SURFACE SUBSKIN TEMPERATURE);
change note: 2019-08-28 13:14:01.0 [sritz] Insert Concept add broader relation (SEA SURFACE SUBSKIN TEMPERATURE [68a09c56-be36-4100-8757-3a6eec7dc251,369091] - SEA SURFACE TEMPERATURE [bd24a9a9-7d52-4c29-b2a0-6cefd216ae78,83965]);
definition: The sea surface subskin temperature is the temperature at the base of the conductive laminar sub-layer of the ocean surface, that is, at a depth of approximately 1 - 1.5 millimeters below the air-sea interface. For practical purposes, this quantity can be well approximated to the measurement of surface temperature by a microwave radiometer operating in the 6 - 11 gigahertz frequency range, but the relationship is neither direct nor invariant to changing physical conditions or to the specific geometry of the microwave measurements. Measurements of this quantity are subject to a large potential diurnal cycle due to thermal stratification of the upper ocean layer in low wind speed high solar irradiance conditions.
in scheme: sciencekeywords

SEA SURFACE TEMPERATURE
type: Concept