NASA
type: Concept

NASA/ARC/ECOCAST
type: Concept
definition: Welcome to the Ecological Forecasting Lab at NASA Ames Research Center. Our mission is to use the Terrestrial Observation and Prediction System (TOPS) to develop nowcasts and forecasts of ecosystem conditions for use in a range of applications.
in scheme: providers