ZA/DPLG/SANDMC
type: Concept
definition: The South African National Disaster Management Centre (NDMC) has been constituted with the objective to promote an integrated and co-coordinated system of disaster management, with a special emphasis on prevention and mitigation, by national, provincial and municipal organs of state, statutory functionaries, other role-players and communities. The NDMC currently resides with the Department of Provincial and Local Government. Website: http://www.ndmc.gov.za/ [Summary provided by The South African National Disaster Management Centre.]
in scheme: providers

SOUTH AFRICA
type: Concept