GVP
type: Concept
change note: 2013-06-02 23:00:37.0 [sgrebas] update Definition (The Smithsonian's Global Volcanism Program seeks better understanding of all volcanoes through documenting their eruptions small as well as large during the past 10,000 years. Information provided by http://www.volcano.si.edu/);
definition: The Smithsonian's Global Volcanism Program seeks better understanding of all volcanoes through documenting their eruptions small as well as large during the past 10,000 years. Information provided by http://www.volcano.si.edu/
in scheme: projects

G - I
type: Concept